python unittest fail

import?unittest

class?Test(unittest.TestCase):
????def?setUp(self):
????????print?"pass"

????def?test_sum_1(self):
????????self.assertEqual(self.sum_1(1,?3),?3,?test?success)

????def?sum_1(self,?a,?b):
????????return?a?+?b

????def?tearDown(self):
????????print?"pass"

if?__name__?==?__main__:
????unittest.main()

只有出錯了才提示,比如上面那個我改了下參數,報告如下:

F
======================================================================
pass
FAIL: test_sum_1 (__main__.Test)
pass
----------------------------------------------------------------------
Traceback (most recent call last):
? File "/home/b43258/Workspace/wjs/test.py", line 17, in test_sum_1
??? self.assertEqual(self.sum_1(1, 3), 3, test success)
AssertionError: test success

----------------------------------------------------------------------
Ran 1 test in 0.000s

FAILED (failures=1)


如果解決了您的問題請采納!
如果未解決續追問

ユメマカセ主題曲歌詞 chaozhou pate nodejs v0.10.13 yunggirl and oldman forced to lactate IDBD-621 アオイトリ 中文補丁 くない怎么用 yy語音官方登錄 radiocarpal joint 微信安全中心官網首頁 十錦緞 小慕容和顏鐵 阜陽916電臺魏姐照片 www.haofamen.net shame on china 果たして だろうか removeclass sel 天上人間漫畫十大絕活 關于夢想的文章 libtpnssecurity.so se18yo_elaine thunder ps免摳透明相框素材 牧神記 女主角 春節打牌小茜小說目錄 display mate 國元 dragon ball HD shanxilishibowuguan sandwith 番外 葉起臻

Copyright 中侖網 Some Rights Reserved

如反饋或投訴等情況聯系:une35498#163.com

云南十一选五号码推荐